autonomie énergétique
type: Concept
type: NamedIndividual
alternative label: dépendance énergétique
broader: indicateur d autonomie alimentaire
definition: [OCL 2014, 21(4) D404 c B. Rouillé et al., Published by EDP Sciences 2014 DOI: 10.1051/ocl/2014017]
editorial note: AT-ARI
in scheme: MTIndicateurs
in scheme: Thesaurus Agroecologie

RDF description of autonomie_energetique
primary topic: autonomie énergétique