RDF description of biodiversite_planifiee
primary topic: biodiversité planifiée

biodiversité planifiée
type: Concept
type: NamedIndividual
alternative label: biodiversité contrôlée
broader: valorisation de la biodiversite
definition: Planned biodiversity (or controlled biodiversity) is defined as the biodiversity chosen by the farmer. It is made up of different cultivated species and plant varieties as well as different bred species and breeds of animals. It is one of the two components of agricultural biodiversity or “agrobiodiversity”, the other being associated biodiversity which is not chosen by the farmer...[Dictionary of agroecology : https://dicoagroecologie.fr/en/encyclopedia/planned-biodiversity/] @en
editorial note: AT-ARI
in scheme: Thesaurus Agroecologie
in scheme: MTLeviers