RDF description of cereale_fourragere
primary topic: céréale fourragère

céréale fourragère
type: Concept
type: NamedIndividual
alternative label: céréales récoltées en vert
broader: fourrage annuel
definition: Ensemble de plantes cultivées pour leurs graines. La plante entière est utilisée pour l'alimentation animal sous forme de fourrage comsommé en vert.
editorial note: IRSTEA
in scheme: Thesaurus Agroecologie
in scheme: MTLeviers