RDF description of couverture_vegetale_permanente
primary topic: couverture végétale permanente

couverture végétale permanente
type: Concept
type: NamedIndividual
alternative label: couvert végétal permanent
broader: couvert vegetal
definition: Alternance successive de cultures annuelles et de cultures Intermédiaires, de façon à ce que le sol soit toujours occupé par des plantes maîtrisées... [Dictionnaire d'agroécologie : https://dicoagroecologie.fr/encyclopedie/couverture-vegetale-permanente/]
editorial note: AT-ARI
in scheme: Thesaurus Agroecologie
in scheme: MTLeviers