féverole de printemps
type: Concept
type: NamedIndividual
alternative label: féverole printemps
broader: feverole
definition: féverole semée après le mois de février.
editorial note: le type « printemps », à tige unique, à période végétative courte et sensible. Source Larousse Agricole;IRSTEA
in scheme: Thesaurus Agroecologie
in scheme: MTLeviers
note: http://www.larousse.fr/archives/agricole/page/261

RDF description of feverole_de_printemps
primary topic: féverole de printemps