intrant organique
type: Concept
type: NamedIndividual
broader: effluent d elevage
definition: Les intrants organiques sont issus de la transformation de produits végétaux et animaux que l’agriculteur apporte a? sa culture pour qu’elle exprime son potentiel de production. Inclus dans les intrants biologiques, les intrants organiques les plus courants sont les fumiers, lisiers et composts de déchets verts... [Dictionnaire d'agroécologie : https://dicoagroecologie.fr/encyclopedie/intrant-organique/]
editorial note: AT-ARI
in scheme: Thesaurus Agroecologie
in scheme: MTLeviers

RDF description of intrant_organique
primary topic: intrant organique