luzerne
type: Concept
type: NamedIndividual
alternative label: grand trèfle
broader: legumineuse fourragere
definition: Plante utilisée comme fourrage dans la création de prairies. Le fourrage peut être frais ou déshydraté.
editorial note: IRSTEA;Légumineuse vivace cultivée essentiellement pour la production de fourrage, en culture pure ou en mélange, le plus souvent avec des graminées (genre Medicago, famille des papilionacées)....Adaptée à la production de foin, la luzerne peut aussi être pâturée, ensilée ou déshydratée. Source Larousse agricole
in scheme: Thesaurus Agroecologie
in scheme: MTLeviers
note: https://fr.wikipedia.org/wiki/Luzerne_cultiv%C3%A9e

RDF description of luzerne
primary topic: luzerne