RDF description of mais_fourrage
primary topic: maïs fourrage

maïs fourrage
type: Concept
type: NamedIndividual
alternative label: maïs ensilage
broader: fourrage annuel
definition: Plante cultivée comme fourrage pour les animaux. elle peut être consommé en vert ou après ensilage.
editorial note: Le maïs est également cultivé comme fourrage. Dans ce cas, c'est la plante entière qui est récoltée avant maturité des grains. Elle peut être donnée en vert aux animaux, mais l'est le plus souvent sous forme d'ensilage. Source Larousse Agricole;IRSTEA
in scheme: Thesaurus Agroecologie
in scheme: MTLeviers
note: http://www.larousse.fr/archives/agricole/page/357