RDF description of meteil
primary topic: méteil

méteil
type: Concept
type: NamedIndividual
alternative label: blé-seigle
broader: culture fourragere
definition: Mélange de deux céréales pour l'alimentation animale. Culture composée de deux plantes le blé et le seigle pour alimentation humaine.
editorial note: IRSTEA;Culture composée d'un mélange de blé et de seigle. Le méteil permet d'obtenir dès la récolte, et sans opération ultérieure à la ferme, un aliment équilibré sur le plan nutritionnel. Autrefois très pratiqué, ce mode de culture ne l'est plus guère en France que dans certaines régions de demi-montagne. Source Larousse Agricole
in scheme: Thesaurus Agroecologie
in scheme: MTLeviers
narrower: meteil fourrage
narrower: meteil grain
note: https://fr.wikipedia.org/wiki/M%C3%A9teil