RDF description of navette_fourragere
primary topic: navette fourragère

navette fourragère
type: Concept
type: NamedIndividual
broader: diverse fourragere
definition: Plante cultivée pour ses graines riches en lipides. En france elle est utilisée plante entière comme fourrage vert ou fourrage ensillé en alimentation animale. La navette est aussi utilisée comme engrais vert.
editorial note: Plante voisine du colza cultivée pour son huile alimentaire, comme plante fourragère et éventuellement comme engrais vert (espèce Brassica campestris, famille des crucifères). Source Larousse agricole;IRSTEA
in scheme: Thesaurus Agroecologie
in scheme: MTLeviers
note: http://www.larousse.fr/archives/agricole/page/389#t3256