polyculture-élevage
type: Concept
type: NamedIndividual
alternative label: système polyculture-élevage
broader: Systemes
definition: La polyculture-élevage est un système de production agricole combinant une ou plusieurs cultures (destinée(s) à la vente et/ou à l’alimentation des animaux) et au moins un élevage. Un tel système tend vers l’agroécologie quand les animaux sont alimentés par les cultures et prairies, lesquelles sont fertilisées en retour par leurs déjections. La polyculture-élevage peut se définir au niveau d’une exploitation agricole ou entre exploitations agricoles (au moins deux ou un collectif) se coordonnant pour la gestion de flux de matières (grain, fourrage, effluent) ou via une organisation économique (par ex. une coopérative) gérant ces flux... [Dictionnaire d'agroécologie : https://dicoagroecologie.fr/encyclopedie/polyculture-elevage/]
editorial note: AT-ARI
in scheme: MTSystemes
in scheme: Thesaurus Agroecologie

RDF description of polyculture-elevage
primary topic: polyculture-élevage