RDF description of prairie_a_flores_variees
primary topic: prairie à flores variées

prairie à flores variées
type: Concept
type: NamedIndividual
broader: prairie multi-especes
definition: A high-diversity sown grasslandis a grassland which is sown with a diversity of species and varieties. The sowing is carried out with a mixture of over six species belonging to at least three different botanical families for grazing pastures and two families for exclusively mowed grasslands... [Dictionary of agroecology : https://dicoagroecologie.fr/en/encyclopedia/high-diversity-sown-grassland/] @en
editorial note: AT-ARI
in scheme: Thesaurus Agroecologie
in scheme: MTLeviers