santé du sol
type: Concept
type: NamedIndividual
broader: vie du sol
definition: La santé des sols correspond à la capacité du sol à fonctionner sur le long terme comme un système vivant, i.e., capable d’assurer une productivité de biomasse végétale compatible avec le maintien à long terme des fonctionnalités écologiques de l’écosystème naturel ou cultivé, de même que les processus connexes : participation à la préservation des ressources naturelles que sont l’air, l’eau et la biodiversité dans leurs dimensions quantitatives et qualitatives, et à la santé des plantes, des animaux et de l’homme en favorisant les processus physiologiques impliqués dans leurs systèmes d’autodéfense... [Dictionnaire d'agroécologie : https://dicoagroecologie.fr/encyclopedie/sante-des-sols/]
editorial note: AT-ARI
in scheme: MTEnjeux
in scheme: Thesaurus Agroecologie

RDF description of sante_du_sol
primary topic: santé du sol