RDF description of sante_globale
primary topic: santé globale

santé globale
type: Concept
type: NamedIndividual
alternative label: une seule santé
broader: Enjeux
definition: Le concept de « one health », traduit par « une seule santé », vise à prendre en compte les interdépendances entre l’état de santé des différents domaines du vivant (des écosystèmes à l’homme). Considérer ces interdépendances permet de renouveler l’analyse de la durabilité des systèmes agro-alimentaires...[Dictionnaire d'agroécologie : https://dicoagroecologie.fr/encyclopedie/une-seule-sante/]
in scheme: Thesaurus Agroecologie