sélection participative des semences
type: Concept
type: NamedIndividual
alternative label: sélection participative
broader: action collective
definition: Participatory breeding is a collective mode of genetic improvement of plants which brings together different stakeholders, including researchers, farmers, facilitators, etc. This participatory approach supplements the limits of the delegating mode of plant breeding established post-war in Europe, mode in which research and innovation were delegated by farmers to a small group of professionals, breeders and seed companies. ...[Dictionary of agroecology : https://dicoagroecologie.fr/en/encyclopedia/participatory-plant-breeding/] @en
editorial note: AT-ARI
in scheme: Thesaurus Agroecologie
in scheme: MTLeviers

RDF description of selection_participative_des_semences
primary topic: sélection participative des semences