RDF description of service_ecosystemique
primary topic: service écosystémique

service écosystémique
type: Concept
type: NamedIndividual
alternative label: service éco-systémique
broader: valorisation de la biodiversite
definition: Les services écosystémiques sont définis comme étant les biens et services que les hommes peuvent tirer des écosystèmes, directement ou indirectement, pour assurer leur bien-être (nourriture, qualité de l’eau, paysages,…). Issue des travaux à l’interface entre économie et écologie, cette notion se base sur le postulat qu’on peut attribuer une valeur, souvent monétaire, à la nature. C’est en partie pour cette raison que la notion de services écosystémiques est largement en débat. Il existe notamment une vision alternative qui met en avant l’intérêt de la notion de services écosystémiques pour révéler et mieux comprendre les interactions homme-nature... [Dictionnaire d'agroécologie : https://dicoagroecologie.fr/encyclopedie/services-ecosystemiques-dans-les-agroecosystemes/]
editorial note: AT-ARI
in scheme: Thesaurus Agroecologie
in scheme: MTLeviers