trèfle blanc
type: Concept
type: NamedIndividual
alternative label: trèfle de Hollande
broader: trefle
definition: Plante utilisée comme fourrage pour la création de prairies artificielles
editorial note: Légumineuse fourragère vivace, spontanée en Europe, à tiges rampantes (stolons) et à fleurs blanches légèrement rosées, cultivée pour son fourrage et utilisée en jachères cultivées (espèce Trifolium repens, famille des papilionacées). Source Larousse Agricole;IRSTEA
in scheme: Thesaurus Agroecologie
in scheme: MTLeviers
note: http://www.larousse.fr/archives/agricole/page/570#t4754

RDF description of trefle_blanc
primary topic: trèfle blanc