RDF description of c2_112
primary topic: biotic environment

biotic environment
type: Concept
has status: Published
modified: 2015-07-16T08:40:57Z
definition: Living organisms component of the environment.
in scheme: anaeeThes
narrower: c3 3380
narrower: c3 3381
narrower: c2 173
narrower: c a3f480a0
narrower: c3 2393
narrower: c bfc04615
narrower: c d3b61ca4
narrower: c3 3379
preferred label: environnement biotique @fr
top concept of: anaeeThes