ecosystem functioning
type: Concept
has status: Published
modified: 2017-03-13T08:25:03Z
broader: c_1402038921919
definition: Biological, geochemical and physical processes and components that take place or occur within an ecosystem.
definition: def e346f92a
in scheme: anaeeThes
narrower: c 10a56e7d
narrower: c_1438872231063
narrower: c_1437640614045
narrower: c_1438939240695
narrower: c_1438873596178
narrower: c_1438873666416
narrower: c3 2545
narrower: c_1437641394694
narrower: c_1438958199089
narrower: c c6a3b627
narrower: c 4622158e
narrower: c_1406135113366
narrower: c_1402044856037
narrower: c_1438871958817
narrower: c_1438951820900
narrower: c_1405700771858
narrower: c3 2556
narrower: c_1438940932444
narrower: c 5443eac8
narrower: c_1438939609440
narrower: c3 2592
narrower: c3 2520
narrower: c3 2489
narrower: c3 2433
narrower: c_1438956487143
preferred label: fonctionnement des écosystèmes @fr

RDF description of c2_113
primary topic: ecosystem functioning