RDF description of c2_126
primary topic: nutrient

nutrient
type: Concept
has status: Published
modified: 2020-06-11T13:09:54.894+02:00
broader: c3 343
definition: Chemical elements which are involved in the construction of living tissue and which are needed by both plant and animal. The most important in terms of bulk are carbon, hydrogen and oxygen, with other essential ones including nitrogen, potassium, calcium, sulphur and phosphorus.
definition: i def c2 126
in scheme: anaeeThes
narrower: c3 2589
narrower: c3 2390
narrower: c2 2982
narrower: c3 2588
preferred label: élément nutritif @fr