RDF description of c2_133
primary topic: animal reproduction

animal reproduction
type: Concept
has status: Published
modified: 2014-07-18T11:56:31Z
broader: c3 361
definition: i def c2 133
definition: Any of various processes, either sexual or asexual, by which an animal produces one or more individuals similar to itself.
in scheme: anaeeThes
narrower: c3 368
narrower: c3 356
narrower: c3 365
narrower: c3 372
narrower: c3 360
narrower: c3 370
narrower: c3 358
preferred label: reproduction animale @fr