leaf
type: Concept
has status: Published
modified: 2019-09-06T17:57:11Z
alternative label: foliage
alternative label: leaves
broader: c2 153
definition: i def c2 154
definition: The main organ of photosynthesis and transpiration in higher plants, usually consisting of a flat green blade attached to the stem directly or by a stalk.
in scheme: anaeeThes
narrower: c 1bef023d
narrower: c3 2317
narrower: c_1404121430730
narrower: c_1404121297011
narrower: c_1404121258154
narrower: c_31188646
narrower: c4 2876
narrower: c 6b244b96
narrower: c b2f2bd65
narrower: c 0115cf7c
narrower: c 1d00360e
narrower: c_1404128673695
preferred label: feuille @fr

RDF description of c2_154
primary topic: leaf