protocol
type: Concept
has status: Published
modified: 2020-11-30T20:11:25.675+01:00
broader: c2 115
definition: xDef e89b3598
definition: The procedures followed to obtain measurements
in scheme: anaeeThes
narrower: c_1402411130982
narrower: c 3c5beca3
narrower: c bba52661
narrower: c3 2647
narrower: c3 2756
narrower: c3 2749
narrower: c2 2782
narrower: c_66043170
narrower: c3 2750
narrower: c2 2792
narrower: c3 2640
narrower: c3 2643
narrower: c2 2790
preferred label: protocole @fr

RDF description of c2_169
primary topic: protocol