living organism (classification)
type: Concept
has status: Published
modified: 2017-01-30T10:14:06Z
broader: c2 112
definition: An individual constituted to carry out all life functions
in scheme: anaeeThes
narrower: c2 2758
narrower: c2 2441
narrower: c2 2760
narrower: c2 220
narrower: c3 2761
narrower: c bf5c15cc
narrower: c_1403182268869
preferred label: organisme vivant (classification taxonomique) @fr

RDF description of c2_173
primary topic: living organism (classification)