RDF description of c2_177
primary topic: animal

animal
type: Concept
has status: Published
modified: 2020-11-30T20:29:07.570+01:00
alternative label: animals
alternative label: animaux @fr
broader: c2 2758
definition: i def c2 177
definition: Any living organism characterized by voluntary movement, the possession of cells with noncellulose cell walls and specialized sense organs enabling rapid response to stimuli, and the ingestion of complex organic substances such as plants and other animals.
in scheme: anaeeThes
narrower: c2 195
narrower: c 194737d7
narrower: c2 180
narrower: c2 179
narrower: c 66bcaa35
narrower: c_1438960700520