arthropod
type: Concept
has status: Published
modified: 2020-04-17T10:07:26.409+02:00
alternative label: arthropods
broader: c2 180
definition: i def c2 183
definition: The largest phylum in the animal kingdom; adults typically have segmented body, a sclerotized integument, and many-jointed segmental limbs.
in scheme: anaeeThes
narrower: c2 185
narrower: c2 184
preferred label: arthropode @fr

RDF description of c2_183
primary topic: arthropod