RDF description of c2_187
primary topic: crustacean

crustacean
type: Concept
has status: Published
modified: 2020-04-22T10:55:11.675+02:00
alternative label: crustacea
alternative label: crustaceans
broader: c2 180
definition: A class of arthropod animals having jointed feet and mandibles, two pairs of antennae, and segmented, chitin-encased bodies.
definition: i def c2 187
in scheme: anaeeThes
narrower: c2 189
narrower: c2 188
preferred label: crustacé @fr