mollusk
type: Concept
has status: Published
modified: 2020-04-22T11:12:46.778+02:00
alternative label: mollusks
alternative label: mollusca
broader: c2 180
definition: i def c2 192
definition: Any of various invertebrates having a soft unsegmented body and often a shell, secreted by a fold of skin.
in scheme: anaeeThes
narrower: c2 193
narrower: c_1403077948893
preferred label: mollusque @fr

RDF description of c2_192
primary topic: mollusk