nematode
type: Concept
has status: Published
modified: 2020-04-22T12:12:38.542+02:00
alternative label: nématodes @fr
alternative label: nematodes
alternative label: nematoda
broader: c2 180
definition: i def c2 194
definition: A group of unsegmented worms which have been variously recognized as an order, class, and phylum.
in scheme: anaeeThes
preferred label: nématode @fr

RDF description of c2_194
primary topic: nematode