vertebrates
type: Concept
has status: Published
modified: 2017-03-13T08:14:07Z
broader: c2 177
definition: i def c2 195
definition: Any chordate animal of the subphylum Vertebrata, characterized by a bony or cartilaginous skeleton and a well-developed brain: the group contains fishes, amphibians, reptiles, birds, and mammals.
in scheme: anaeeThes
narrower: c2 196
narrower: c2 201
narrower: c2 204
narrower: c2 198
narrower: c2 199
preferred label: vertébrés @fr

RDF description of c2_195
primary topic: vertebrates