RDF description of c2_197
primary topic: salamander

salamander
type: Concept
has status: Published
modified: 2020-05-14T08:44:53.076+02:00
alternative label: salamanders
broader: c2 196
definition: i def c2 197
definition: Any of various urodele amphibians, such as Salamandra salamandra of central and S Europe. They are typically terrestrial, have an elongated body, and only return to water to breed.
in scheme: anaeeThes
preferred label: salamandre @fr