RDF description of c2_201
primary topic: mammal

mammal
type: Concept
has status: Published
modified: 2020-04-23T10:04:27.896+02:00
alternative label: mammals
broader: c2 195
definition: Any animal of the Mammalia, a large class of warm-blooded vertebrates having mammary glands in the female, a thoracic diaphragm, and a four-chambered heart. The class includes the whales, carnivores, rodents, bats, primates, etc.
definition: i def c2 201
in scheme: anaeeThes
narrower: c2 214
narrower: c2 203
preferred label: mammifère @fr