lizard
type: Concept
has status: Published
modified: 2020-04-23T11:25:21.846+02:00
alternative label: lacertilia
alternative label: lizards
broader: c2 204
definition: i def c2 205
definition: Any reptile of the suborder Lacertilia, especially those of the family Lacertidae, typically having an elongated body, four limbs, and a small tail: includes the gechos, iguanas, chameleons, monitors, and slow worms.
in scheme: anaeeThes
preferred label: lézard @fr

RDF description of c2_205
primary topic: lizard