benthos
type: Concept
has status: Published
modified: 2020-04-17T09:49:04.247+02:00
broader: c2 2441
definition: i def c2 206
definition: Those organisms attached to, living on, in or near the sea bed, river bed or lake floor.
in scheme: anaeeThes
narrower: c2 208
narrower: c2 207

RDF description of c2_206
primary topic: benthos