RDF description of c2_225
primary topic: plant

plant
type: Concept
has status: Published
modified: 2018-06-26T14:47:36Z
broader: c2 2758
definition: Any living organism that typically synthesizes its food from inorganic substances, possesses cellulose cell walls, responds slowly and often permanently to a stimulus, lacks specialized sense organs and nervous system, and has no powers of locomotion. (Source: CED)
in scheme: anaeeThes
narrower: c2 2440
narrower: c 4d1cf953
narrower: c2 226
narrower: c2 243
preferred label: plante @fr