flower
type: Concept
has status: Published
modified: 2020-04-27T19:15:26.811+02:00
alternative label: flowers
broader: c2 2439
definition: i def c2 229
definition: The reproductive structure of angiosperm plants, consisting of stamens and carpels surrounded by petals and sepals all borne on the receptacle.
in scheme: anaeeThes
preferred label: fleur @fr

RDF description of c2_229
primary topic: flower