carbon
type: Concept
has status: Published
alternative label: C
broader: c2 2308
definition: A nonmetallic element existing in the three crystalline forms: graphite, diamond and buckminsterfullerene: occurring in carbon dioxide, coal, oil and all organic compounds.
definition: i def c2 2314
in scheme: anaeeThes
preferred label: carbone @fr

RDF description of c2_2314
primary topic: carbon