iodine
type: Concept
has status: Published
alternative label: I
broader: c2 2308
definition: A nonmetallic halogen element; the poisonous, corrosive dark plates or granules are readily sublimed; insoluble in water, soluble in common solvents; used as germicide and antiseptic, in dyes, tinctures, and pharmaceuticals, in engraving lithography, and as a catalyst and analytical reagent.
definition: i def c2 2361
in scheme: anaeeThes
preferred label: iode @fr

RDF description of c2_2361
primary topic: iodine