grain
type: Concept
has status: Published
modified: 2020-04-27T19:19:29.408+02:00
alternative label: seeds
broader: c2 2439
definition: Edible, starchy seeds of the grass family (Graminae) usable as food by man and his livestock.
definition: i def c2 242
in scheme: anaeeThes
narrower: c 1358c95d
narrower: c3 2869
narrower: c 83a57a8a
narrower: c 945889ec
narrower: c 6f2173e2
narrower: c 9983c69d
narrower: c 6726541e
narrower: c 2c4eace5
narrower: c 0f92c131
narrower: c a26a5dcf

RDF description of c2_242
primary topic: grain