RDF description of c2_244
primary topic: fern

fern
type: Concept
has status: Published
modified: 2020-04-23T16:18:23.745+02:00
alternative label: ferns
broader: c2 243
definition: Any of a large number of vascular plants composing the division Polypodiophyta, without flowers and fruits.
definition: i def c2 244
in scheme: anaeeThes
preferred label: fougère @fr