RDF description of c2_2440
primary topic: bryophyte

bryophyte
type: Concept
has status: Published
modified: 2020-06-24T15:46:40.060+02:00
alternative label: bryophytes
broader: c2 225
definition: i def c2 2440
definition: Any plant of the division Bryophyta, having stems and leaves but lacking true vascular tissue and roots and reproducing by spores: includes the mosses and liverworts. @en
in scheme: anaeeThes
narrower: c2 234
narrower: c2 233