RDF description of c2_2445
primary topic: abiotic environment

abiotic environment
type: Concept
has status: Published
modified: 2020-11-05T18:12:25.337+01:00
definition: The non-living components of the environment (rocks, minerals, soil, water and climate).
definition: i def c2 2445
in scheme: anaeeThes
narrower: c2 2460
narrower: c_1403182065227
narrower: c_1437026779187
narrower: c2 2695
narrower: c_1437026950671
narrower: c2 2509
preferred label: environnement abiotique @fr
top concept of: anaeeThes