air
type: Concept
has status: Published
modified: 2020-11-30T20:52:48.185+01:00
broader: c_1403182065227
definition: A predominantly mechanical mixture of a variety of individual gases forming the earth's enveloping atmosphere.
definition: i def c2 2446
in scheme: anaeeThes
narrower: c 4df7daa2
narrower: c_1438933384943
narrower: c2 2464
narrower: c_1442245425046
narrower: c 9b28a52b
narrower: c2 2447
narrower: c2 2458
narrower: c 3060e3e2
narrower: c2 2459
narrower: c e88f5361
narrower: c 46992aa0
narrower: c de284bb6
narrower: c df23f4ca

RDF description of c2_2446
primary topic: air