air temperature
type: Concept
has status: Published
modified: 2020-09-02T15:39:22.198+02:00
broader: c_1438961017921
definition: The temperature of the atmosphere which represents the average kinetic energy of the molecular motion in a small region and is defined in terms of a standard or calibrated thermometer in thermal equilibrium with the air. (Source: MGH)
in scheme: anaeeThes
narrower: c2 2462
narrower: c b6d49d61
narrower: c 625b7c7f
narrower: c 45e23b24
narrower: c2 2927
preferred label: température de l'air @fr

RDF description of c2_2461
primary topic: air temperature