rayonnement net de courte longueur d'onde
type: Concept
has status: Published
modified: 2020-07-24T20:37:21.928+02:00
broader: c2 2469
definition: $$01 problème : net short wave est différent de net solar
in scheme: anaeeThes
preferred label: net shortwave radiation @en

RDF description of c2_2473
primary topic: rayonnement net de courte longueur d'onde