flux de chaleur sensible
type: Concept
has status: Published
modified: 2016-01-06T09:46:46Z
broader: c bed02bc4
definition: $$01 problème : chaleur latente ou flux de chaleur latente
in scheme: anaeeThes
preferred label: sensible heat flux @en

RDF description of c2_2492
primary topic: flux de chaleur sensible