shrub
type: Concept
has status: Published
modified: 2017-03-09T17:26:55Z
broader: c2 243
definition: i def c2 249
definition: A woody perennial plant, smaller than a tree, with several major branches arising from near the base of the main stem.
in scheme: anaeeThes
preferred label: arbuste @fr

RDF description of c2_249
primary topic: shrub