RDF description of c2_250
primary topic: tree

tree
type: Concept
has status: Published
modified: 2016-01-06T09:46:49Z
broader: c2 243
definition: i def c2 250
definition: Any large woody perennial plant with a distinct trunk giving rise to branches or leaves at some distance from the ground.
in scheme: anaeeThes
narrower: c_1437639701636
narrower: c_1437639757678
preferred label: arbre @fr