sand
type: Concept
has status: Published
modified: 2014-07-18T10:11:52Z
broader: c2 2527
definition: % or g Kg-1
definition: A loose material consisting of small mineral particles, or rock and mineral particles, distinguishable by the naked eye; grains vary from almost spherical to angular, with a diameter range from 1/16 to 2 millimeters.
definition: i def c2 2588
in scheme: anaeeThes
narrower: c 1713243b
preferred label: sable @fr

RDF description of c2_2588
primary topic: sand