RDF description of c2_2686
primary topic: cation

cation
type: Concept
has status: Published
modified: 2020-04-28T12:44:45.163+02:00
alternative label: cations
broader: c2 2685
definition: i def c2 2686
definition: A positively charged atom or group of atoms, or a radical which moves to the negative pole (cathode) during electrolysis.
in scheme: anaeeThes
narrower: c2 2687
narrower: c_1405593560338